{"text_format":"1","workbook":"xlsx","n_sheets":9,"sheets":["Rammebetingelser","Teknologiliste","PrisFaktorer","SETUP","Sheet1","FAQ_TL","LHT-noter","OUTPUT-OLD","OUTPUT"],"not_rendered":{"charts":0,"images":4,"macros":1,"external_links":4,"defined_names":33,"comments":1,"pivot_tables":0},"unopened":[],"bounds":{"document_bytes":16777216,"sheet_cells":100000,"rows_first":2000,"rows_last":500,"rows_between":2000,"halvings":0,"cell_chars":16384,"cell_head_chars":4096},"cells_cut":0,"cells_raw":0,"read":"whole","date_system":"1900"}

{"sheet":"Rammebetingelser","index":0,"n_rows":19,"n_cols":16,"rows_kept":19,"cut":false,"hidden":false,"merged":[[14,1,14,15]]}
[null,"RB_1","RB_2","RB_3","RB_4","RB_5","RB_6","RB_7","RB_8","RB_9","RB_10","RB_11","RB_12","RB_13","RB_14","RB_15"]
[null,"Kapacitet (m3/t)","Geografisk placering","Lokalitet (land/by)","Årlig produktion","Løftehøjde","Geo-/hydrologiske vanskeligheder","Råvands-kvalitet"]
[1,"0 - 25",95,"Land","0 - 100.000","0 - 30","ingen","simpel"]
[2,"25 - 50",100,"By","100.000 - 250.000","30 - 60","moderat","moderat"]
[3,"50 - 100",110,"City","250.000 - 500.000","> 60","vanskelig","vanskelig"]
[4,"> 100",115,"Indre city","500.000 - 1 mio",null,"meget vanskelig","meget vanskelig"]
[5,null,null,null,"> 1 mio"]
[6]
[7]
[8]
[9]
[10]
[null,{"$f":"COUNTA(B3:B12)","v":4},{"$f":"COUNTA(C3:C12)","v":4},4,5,3,4,4,0,0,0,0,0,0,0,0]
[]
[null,"Tabellen er ændret! Tryk på knappen og opdatér TL-arket"]
[]
[]
[]
[null,null,false]

{"sheet":"Teknologiliste","index":1,"n_rows":409,"n_cols":74,"rows_kept":409,"cut":false,"hidden":false,"merged":[[2,31,2,32],[1,19,1,20],[1,21,1,22],[1,23,1,24],[1,25,1,26],[1,27,1,28],[2,21,2,22],[2,23,2,24],[2,25,2,26],[2,27,2,28],[2,29,2,30],[1,1,2,7],[1,8,2,12],[1,13,1,14],[1,15,1,16],[1,17,1,18],[2,13,2,14],[0,44,3,73],[2,39,2,40],[2,41,2,42],[2,15,2,16],[2,17,2,18],[2,33,2,34],[2,35,2,36],[2,37,2,38],[1,33,1,34],[1,35,1,36],[1,37,1,38],[1,39,1,40],[1,41,1,42],[1,29,1,30],[1,31,1,32],[2,19,2,20]]}
[null,null,null,null,null,null,null,null,null,null,null,null,"XXX",0,0,1,1,0,0,1,1,0,0,1,1,0,0,1,1,0,0,1,1,0,0,1,1,0,0,1,1,0,0,"XXX","Ikke ret i orange celler - de skal egentlig holdes skjult"]
[null,"Teknologier",null,null,null,null,null,null,"Basis-priser",null,null,null,null,"RB_1",null,"RB_2",null,"RB_3",null,"RB_4",null,"RB_5",null,"RB_6",null,"RB_7",null,"RB_8",null,"RB_9",null,"RB_10",null,"RB_11",null,"RB_12",null,"RB_13",null,"RB_14",null,"RB_15"]
[null,null,null,null,null,null,null,null,null,null,null,null,null,"Kapacitet (m3/t)",null,"Geografisk placering",null,"Lokalitet (land/by)",null,"Årlig produktion",null,"Løftehøjde",null,"Geo-/hydrologiske vanskeligheder",null,"Råvands-kvalitet"]
["Farve","Hovedfunktion","Sort","Teknologigruppe","Teknologi","Levetid (år)","Kilde_lev","Tek-niveau","Anlæg (kr)","Kilde_anl","Drift (kr/år)","Vlh (kr/år)","Enhed","min","max","min","max","min","max","min","max","min","max","min","max","min","max","min","max","min","max","min","max","min","max","min","max","min","max","min","max","min","max"]
[0,"Kildeplads",null,"Forundersøgelse","TEM Geoundersøgelse",1,"Erfaringstal","STD",32500,"Prishåndbogen",0,0,"dag",null,null,null,null,"Land","Land",null,null,null,null,null,null,null,null,null,null,null,null,null,null,null,null,null,null,null,null,null,null,null,null,null,0,0,0,0,0,0,0,0,0,0,0,0,0,0,0,0,0,0,0,0,0,0,0,0,0,0,0,0,0,0]
[0,"Kildeplads",null,"Forundersøgelse","MEP Geoundersøgelse",1,"Erfaringstal","STD",21500,"Prishåndbogen",0,0,"km",null,null,null,null,"Land","Land",null,null,null,null,null,null,null,null,null,null,null,null,null,null,null,null,null,null,null,null,null,null,null,null,null,0,0,0,0,0,0,0,0,0,0,0,0,0,0,0,0,0,0,0,0,0,0,0,0,0,0,0,0,0,0]
[0,"Kildeplads",null,"Forundersøgelse","MRS Sondering",1,"Erfaringstal","STOA",20000,"Erfaringstal",0,0,"stk",null,null,null,null,"Land","Land",null,null,null,null,null,null,null,null,null,null,null,null,null,null,null,null,null,null,null,null,null,null,null,null,null,0,0,0,0,0,0,0,0,0,0,0,0,0,0,0,0,0,0,0,0,0,0,0,0,0,0,0,0,0,0]
[0,"Kildeplads",null,"Forundersøgelse","Model IOL + påvirkning magasin",1,"Erfaringstal","BAT",20000,"Erfaringstal",0,0,"stk",null,null,null,null,null,null,null,null,null,null,null,null,null,null,null,null,null,null,null,null,null,null,null,null,null,null,null,null,null,null,null,0,0,0,0,0,0,0,0,0,0,0,0,0,0,0,0,0,0,0,0,0,0,0,0,0,0,0,0,0,0]
[0,"Kildeplads",null,"Forundersøgelse","Model IOL + alle påvirkning",1,"Erfaringstal","STOA",35000,"Erfaringstal",0,0,"stk",null,null,null,null,null,null,null,null,null,null,null,null,null,null,null,null,null,null,null,null,null,null,null,null,null,null,null,null,null,null,null,0,0,0,0,0,0,0,0,0,0,0,0,0,0,0,0,0,0,0,0,0,0,0,0,0,0,0,0,0,0]
[1,"Kildeplads",null,"Boreplads","Mobilisering, indretning, retablering",50,"Polka","STD",18642,"Prishåndbogen",0,0,"stk",null,null,null,null,null,null,null,null,null,null,null,null,null,null,null,null,null,null,null,null,null,null,null,null,null,null,null,null,null,null,null,0,0,0,0,0,0,0,0,0,0,0,0,0,0,0,0,0,0,0,0,0,0,0,0,0,0,0,0,0,0]
[1,"Kildeplads",null,"Boreplads","Køreplader til boreplads",50,"Erfaringstal","STD",207,"Prishåndbogen",0,0,"døgn",null,null,null,null,null,null,null,null,null,null,null,null,null,null,null,null,null,null,null,null,null,null,null,null,null,null,null,null,null,null,null,0,0,0,0,0,0,0,0,0,0,0,0,0,0,0,0,0,0,0,0,0,0,0,0,0,0,0,0,0,0]
[1,"Kildeplads",null,"Boreplads","Generator 7,5 kW",50,"Erfaringstal","STD",817,"Prishåndbogen",0,0,"døgn",null,null,null,null,null,null,null,null,null,null,null,null,null,null,null,null,null,null,null,null,null,null,null,null,null,null,null,null,null,null,null,0,0,0,0,0,0,0,0,0,0,0,0,0,0,0,0,0,0,0,0,0,0,0,0,0,0,0,0,0,0]
[1,"Kildeplads",null,"Boreplads","50 m slange m. spreder",50,"Erfaringstal","STD",79,"Prishåndbogen",0,0,"døgn",null,null,null,null,null,null,null,null,null,null,null,null,null,null,null,null,null,null,null,null,null,null,null,null,null,null,null,null,null,null,null,0,0,0,0,0,0,0,0,0,0,0,0,0,0,0,0,0,0,0,0,0,0,0,0,0,0,0,0,0,0]
[1,"Kildeplads",null,"Boreplads","50 m slange m. sandfang og beluftning",50,"Erfaringstal","STD",183,"Prishåndbogen",0,0,"døgn",null,null,null,null,null,null,null,null,null,null,null,null,null,null,null,null,null,null,null,null,null,null,null,null,null,null,null,null,null,null,null,0,0,0,0,0,0,0,0,0,0,0,0,0,0,0,0,0,0,0,0,0,0,0,0,0,0,0,0,0,0]
[0,"Kildeplads",null,"Boringsudførelse","Tørboring_Ø250mm_0-30m",50,"Erfaringstal","STD",1257,"Prishåndbogen",0,0,"lbm","0 - 25","0 - 25",null,null,null,null,null,null,null,null,null,null,null,null,null,null,null,null,null,null,null,null,null,null,null,null,null,null,null,null,null,0,0,0,0,0,0,0,0,0,0,0,0,0,0,0,0,0,0,0,0,0,0,0,0,0,0,0,0,0,0]
[0,"Kildeplads",null,"Boringsudførelse","Tørboring_Ø250mm_30-90m",50,"Erfaringstal","STD",1676,"Prishåndbogen",0,0,"lbm","0 - 25","0 - 25",null,null,null,null,null,null,null,null,null,null,null,null,null,null,null,null,null,null,null,null,null,null,null,null,null,null,null,null,null,0,0,0,0,0,0,0,0,0,0,0,0,0,0,0,0,0,0,0,0,0,0,0,0,0,0,0,0,0,0]
[0,"Kildeplads",null,"Boringsudførelse","Tørboring_Ø300mm_0-30m",50,"Erfaringstal","STD",1466,"Prishåndbogen",0,0,"lbm","0 - 25","25 - 50",null,null,null,null,null,null,null,null,null,null,null,null,null,null,null,null,null,null,null,null,null,null,null,null,null,null,null,null,null,0,0,0,0,0,0,0,0,0,0,0,0,0,0,0,0,0,0,0,0,0,0,0,0,0,0,0,0,0,0]
[0,"Kildeplads",null,"Boringsudførelse","Tørboring_Ø300mm_30-90m",50,"Erfaringstal","STD",2095,"Prishåndbogen",0,0,"lbm","0 - 25","25 - 50",null,null,null,null,null,null,null,null,null,null,null,null,null,null,null,null,null,null,null,null,null,null,null,null,null,null,null,null,null,0,0,0,0,0,0,0,0,0,0,0,0,0,0,0,0,0,0,0,0,0,0,0,0,0,0,0,0,0,0]
[0,"Kildeplads",null,"Boringsudførelse","Lufthæve_Ø450mm_0-50m",50,"Erfaringstal","STD",850,"Prishåndbogen",0,0,"lbm",null,null,null,null,null,null,null,null,null,null,null,null,null,null,null,null,null,null,null,null,null,null,null,null,null,null,null,null,null,null,null,0,0,0,0,0,0,0,0,0,0,0,0,0,0,0,0,0,0,0,0,0,0,0,0,0,0,0,0,0,0]
[0,"Kildeplads",null,"Boringsudførelse","Lufthæve_Ø450mm_50-250m",50,"Erfaringstal","STD",650,"Prishåndbogen",0,0,"lbm",null,null,null,null,null,null,null,null,null,null,null,null,null,null,null,null,null,null,null,null,null,null,null,null,null,null,null,null,null,null,null,0,0,0,0,0,0,0,0,0,0,0,0,0,0,0,0,0,0,0,0,0,0,0,0,0,0,0,0,0,0]
{"$rows_left_out":390}
{"sheet":"PrisFaktorer","index":2,"n_rows":450,"n_cols":48,"rows_kept":450,"cut":false,"hidden":false,"merged":[[420,1,429,1],[430,1,439,1],[290,1,299,1],[300,1,309,1],[310,1,319,1],[320,1,329,1],[380,1,389,1],[330,1,339,1],[340,1,349,1],[350,1,359,1],[360,1,369,1],[370,1,379,1],[410,1,419,1],[390,1,399,1],[400,1,409,1],[220,1,229,1],[230,1,239,1],[80,1,89,1],[90,1,99,1],[100,1,109,1],[190,1,199,1],[160,1,169,1],[200,1,209,1],[130,1,139,1],[140,1,149,1],[150,1,159,1],[120,1,129,1],[260,1,269,1],[270,1,279,1],[250,0,449,0],[250,1,259,1],[10,0,169,0],[170,0,249,0],[170,1,179,1],[180,1,189,1],[240,1,249,1],[10,1,19,1],[20,1,29,1],[30,1,39,1],[440,1,449,1],[210,1,219,1],[110,1,119,1],[280,1,289,1],[6,24,6,26],[8,21,8,23],[8,24,8,26],[8,3,8,5],[8,6,8,8],[8,9,8,11],[8,12,8,14],[6,18,6,20],[7,3,7,5],[7,21,7,23],[7,24,7,26],[8,15,8,17],[8,18,8,20],[8,0,9,0],[8,1,9,1],[8,2,9,2],[6,0,7,2],[6,21,6,23],[6,12,6,14],[6,3,6,5],[6,6,6,8],[6,9,6,11],[6,15,6,17],[70,1,79,1],[7,33,7,35],[7,42,7,44],[7,30,7,32],[7,18,7,20],[7,15,7,17],[7,6,7,8],[7,9,7,11],[7,12,7,14],[8,33,8,35],[40,1,49,1],[50,1,59,1],[60,1,69,1],[8,30,8,32],[6,45,6,47],[7,45,7,47],[8,45,8,47],[6,27,6,29],[6,30,6,32],[6,33,6,35],[6,36,6,38],[6,39,6,41],[7,36,7,38],[7,39,7,41],[8,36,8,38],[8,39,8,41],[6,42,6,44],[8,42,8,44],[8,27,8,29],[7,27,7,29]]}
[]
[]
[]
[]
[]
[]
["Vurdering af\npris-faktorer",null,null,"Rammebetingelse 1",null,null,"Rammebetingelse 2",null,null,"Rammebetingelse 3",null,null,"Rammebetingelse 4",null,null,"Rammebetingelse 5",null,null,"Rammebetingelse 6",null,null,"Rammebetingelse 7",null,null,"Rammebetingelse 8",null,null,"Rammebetingelse 9",null,null,"Rammebetingelse 10",null,null,"Rammebetingelse 11",null,null,"Rammebetingelse 12",null,null,"Rammebetingelse 13",null,null,"Rammebetingelse 14",null,null,"Rammebetingelse 15"]
[null,null,null,"Kapacitet (m3/t)",null,null,"Geografisk placering",null,null,"Lokalitet (land/by)",null,null,"Årlig produktion",null,null,"Løftehøjde",null,null,"Geo-/hydrologiske vanskeligheder",null,null,"Råvands-kvalitet"]
["Hoved-\nfunktion","Teknologi-\ngruppe","Nr","Faktorer",null,null,"Faktorer",null,null,"Faktorer",null,null,"Faktorer",null,null,"Faktorer",null,null,"Faktorer",null,null,"Faktorer",null,null,"Faktorer",null,null,"Faktorer",null,null,"Faktorer",null,null,"Faktorer",null,null,"Faktorer",null,null,"Faktorer",null,null,"Faktorer",null,null,"Faktorer"]
[null,null,null,"Interval/kategori","Anlæg","Drift","Interval/kategori","Anlæg","Drift","Interval/kategori","Anlæg","Drift","Interval/kategori","Anlæg","Drift","Interval/kategori","Anlæg","Drift","Interval/kategori","Anlæg","Drift","Interval/kategori","Anlæg","Drift","Interval/kategori","Anlæg","Drift","Interval/kategori","Anlæg","Drift","Interval/kategori","Anlæg","Drift","Interval/kategori","Anlæg","Drift","Interval/kategori","Anlæg","Drift","Interval/kategori","Anlæg","Drift","Interval/kategori","Anlæg","Drift","Interval/kategori","Anlæg","Drift"]
["Kildeplads","Forundersøgelse",1,"0 - 25",1,1,95,1,1,"Land",1,1,"0 - 100.000",1,1,"0 - 30",1,1,"ingen","0,9",1,"simpel",1,1]
[null,null,2,"25 - 50",1,1,100,1,1,"By",1,1,"100.000 - 250.000",1,1,"30 - 60",1,1,"moderat",1,1,"moderat",1,1]
[null,null,3,"50 - 100",1,1,110,1,1,"City",1,1,"250.000 - 500.000",1,1,"> 60",1,1,"vanskelig","1,1",1,"vanskelig",1,1]
[null,null,4,"> 100",1,1,115,1,1,"Indre city",1,1,"500.000 - 1 mio",1,1,null,null,null,"meget vanskelig","1,5",1,"meget vanskelig",1,1]
[null,null,5,null,null,null,null,null,null,null,null,null,"> 1 mio",1,1]
[null,null,6]
[null,null,7]
[null,null,8]
[null,null,9]
[null,null,10]
{"$rows_left_out":431}
{"sheet":"SETUP","index":3,"n_rows":8,"n_cols":1,"rows_kept":8,"cut":false,"hidden":false,"merged":[]}
[]
[]
["KILDE"]
[]
["Prishåndbogen"]
["Polka"]
["Molio"]
["Erfaringstal"]

{"sheet":"Sheet1","index":4,"n_rows":20,"n_cols":10,"rows_kept":20,"cut":false,"hidden":true,"merged":[]}
[]
[]
[]
[]
[null,null,"tPFmatrice"]
[null,null,null,"HF(1 to 3) as tHFmatrix"]
[null,null,null,"RBs() as string"]
[]
[null,null,null,null,"tHFmatrix"]
[null,null,null,null,null,"Hfnavn as string"]
[null,null,null,null,null,"Tgrække() as tTGrække"]
[]
[null,null,null,null,null,null,"tTGrække"]
[null,null,null,null,null,null,null,"RB() as tFaktorGrp"]
[null,null,null,null,null,null,null,"Tgnavn as string"]
[]
[null,null,null,null,null,null,null,null,"tFaktorGrp"]
[null,null,null,null,null,null,null,null,null,"FaktorIndex() as string"]
[null,null,null,null,null,null,null,null,null,"Rbnavn as string"]
[null,null,null,null,null,null,null,null,null,"Tgnavn as string"]
{"$rows_left_out":1}
{"sheet":"FAQ_TL","index":5,"n_rows":31,"n_cols":12,"rows_kept":31,"cut":false,"hidden":true,"merged":[]}
["Vejledning til Teknologi-ark"]
[]
[null,"Teknologier og Teknologi-grupper"]
[null,"Teknologier knyttes til en hovedfunktion (HF)og inddeles i teknologi-grupper (TG) "]
[null,"TG'erne opstilles i en rækkefølge, som er fornuftig (der kan evt. tildeles en sorterings-kode, som gør, at der kan sorteres uden at anvende gruppens navn til dette)"]
[null,"Hver teknologi tilskrives en levetid (år) og et teknologi-niveau (STD/BAT/STOA)."]
[null,"Alle teknologier i en TG kan prismæssigt skaleres ens."]
[null,"Hvis der er teknologier i en gruppe, som IKKE kan skaleres som resten, skal der oprettes en ny TG"]
[]
[null,"Prissætning"]
[null,"Alle teknologier tildeles basispriser for anlæg (kr),  drift (kr/år) og vedligehold (kr/år), samt enheden for prisen (f.eks. lbm, stk, o.l.)"]
[null,"De faktiske anlægs- og drifts-priser for en teknologi påvirkes af faktorer, som fastsættes på teknologigruppeniveau. Vedligeholdsprisen påvirkes af samme faktor som anlægsprisen."]
[null,"Kilden til de angivne basis- og driftspriser angives (f.eks. prishåndbog, erfaringspris, e.l.)"]
[null,"Afskrivning beregnes automatisk og angives i output (kr/år) og skal ikke angives (Afskrivningspris = Faktisk anlægspris / Levetid)"]
[]
[null,"Min- og maks-anvendelse"]
[null,"Min- og maks-anvendelse knytter sig til den enkelte teknologi, og er en mulighed for at kunne fravælge en teknologi, som ikke giver mening at anvende pga. en RB."]
[null,"Min- og maks anvendes derfor IKKE til at skalere priser, men udelukkende til at fra-vælge specifikke teknologier ved specifikke RB'er."]
[null,"Min- og maks-intervaller knytter sig til de mulige valg, som for en RB er defineret i RB-arket."]
[null,"Min/max sættes kun, hvis det ønskes at fravælge en teknologi ved bestemte RB'er."]
{"$rows_left_out":12}
{"sheet":"LHT-noter","index":6,"n_rows":22,"n_cols":3,"rows_kept":22,"cut":false,"hidden":true,"merged":[]}
[]
[]
[]
["Finn lægger op til at en teknologisk basispris udregnes på baggrund af bl.a. \"makstime\"! \nDenne metode dur ikke, da MAKSTIME er en rammebetingelse - med sine valgmuligheder (0 - 30, 30 - 60, 60 - 90 m3/time) med hver sine faktorer."]
[]
[]
[]
[]
[]
[]
[]
["Hver teknologi tilknyttes en teknologi-gruppe, som igen tilknyttes en hovedfunktion"]
["Hver teknologi tildeles en basis-pris, som udgør en \"typisk\" anlægs-pris for teknologien.\n     Er det f.eks. et filter, kan basisprisen derfor være prisen ved/omkring en minimums-indvinding (30m3/t),\n     mens prisen for en større indvinding reguleres vha. faktorerne vedr. TIMEMAKS og/eller DØGNMAKS"]
["Prisen for en teknologi fastsættes ved valg af forhold (parametre) vedrørende defienrede rammebetingelser. \n     Parametrene tilknyttes hver især en faktor, som anvendes til at påvirke teknologiens pris (ud fra basisprisen)."]
["Hver teknologi tilknyttes et teknologi-niveau (STD/BAT/STOA), som ikke påvirker prisen, men kun er en egenskab for teknologien"]
[]
["For hver rammebetingelse opstilles 1-10 (måske kun 5) forskellige valg (tilknyttet hver sin faktor) for hver teknologi-gruppe. \n     Valgene vil igennem deres tilknyttede faktor påvirke teknologiens anlægspris ved det givne (valgte) forhold vedr. rammebetingelsen.\n     Hvis det vurderes, at en teknologi-gruppe ikke påvirkes af en bestemt rammebetingelse, angives der kun 1 valgmulighed (Uden Betydning), som tildeles en faktor=1\n     Hvis det vurderes, at rammebetingelsen har indflydelse på prisen for teknologien, defineres der et antal mulige valg - hver med sin faktor. \n     Der angives altid valget \"Uden Betydning\" med faktor=1, således at det kan vælges at holde rammebetingelsen udenfor indflydelse."]
[]
[]
["Det foreslås at levere data som indikeret i OUTPUT-ark"]
{"$rows_left_out":3}
{"sheet":"OUTPUT-OLD","index":7,"n_rows":27,"n_cols":10,"rows_kept":27,"cut":false,"hidden":true,"merged":[]}
["Hovedfunktion","Teknologi-gruppe","Teknologi","TekNiveau","RB_Nr","RB_tekst","RB_valg","ANL_pris","DRI_pris","VLH_pris"]
["Kildeplads","Pumpe","SP4","STD",1,"Årlig produktion","Uden Betydning",20000,5000,2000]
["Kildeplads","Pumpe","SP4","STD",1,"Årlig produktion","0 - 10",20000,5000,2000]
["Kildeplads","Pumpe","SP4","STD",1,"Årlig produktion","10 - 25",{"$f":"20000*1.1","v":22000},5000,2000]
["Kildeplads","Pumpe","SP4","STD",1,"Årlig produktion","25 - 50",{"$f":"20000*1.2","v":24000},{"$f":"5000*1.1","v":5500},{"$f":"2000*1.1","v":2200}]
["Kildeplads","Pumpe","SP4","STD",1,"Årlig produktion","50 - 250",{"$f":"20000*1.3","v":26000},{"$f":"5000*1.2","v":6000},{"$f":"2000*1.2","v":2400}]
["Kildeplads","Pumpe","SP4","STD",1,"Årlig produktion","250 - 1000",{"$f":"20000*1.4","v":28000},{"$f":"5000*1.2","v":6000},{"$f":"2000*1.2","v":2400}]
["Kildeplads","Pumpe","SP4","STD",1,"Årlig produktion",">1000",{"$f":"20000*1.6","v":32000},{"$f":"5000*1.3","v":6500},2400]
["Kildeplads","Pumpe","SP4","STD",2,"Maksdøgn","Uden Betydning"]
["Kildeplads","Pumpe","SP4","STD",2,"Maksdøgn","valg 1"]
["Kildeplads","Pumpe","SP4","STD",2,"Maksdøgn","valg 2"]
["Kildeplads","Pumpe","SP4","STD",2,"Maksdøgn","valg 2"]
["Kildeplads","Pumpe","SP4","STD",3,"Makstime","Uden Betydning"]
["Kildeplads","Pumpe","SP4","STD",3,"Makstime","valg 1"]
["Kildeplads","Pumpe","SP4","STD",3,"Makstime","valg 2"]
["Kildeplads","Pumpe","SP4","STD",3,"Makstime","valg 3"]
["Kildeplads","Pumpe","SP4","STD",3,"Makstime","valg 4"]
[null,"- - - "]
["Kildeplads","Pumpe","SP10","STOA"]
[]
{"$rows_left_out":8}
{"sheet":"OUTPUT","index":8,"n_rows":74,"n_cols":22,"rows_kept":74,"cut":false,"hidden":true,"merged":[]}
[1,2,3,4,5,6,7,8,9,10,11,12,13,14,15,16,17,18]
["Hovedfunktion","Teknologi-gruppe","Teknologi","TekNiveau","Levetid","BASIS_pris","KILDE_anlæg","Kilde_levTid","ANLÆG_pris","REL","BEMÆRK","AFSKR_pris","Driftspris","VLH_pris","Enhed","RB1_Makstime (m3)","RB2_Geografisk placering","RB3_Lokalitet (land/by)",null,"RB1","RB2","RB3"]
["Kildeplads","Boringsudførelse","Tørboring_Ø250mm_0-30m","STD",null,1257,null,null,{"$f":"IFERROR(T3*U3*V3*F3,\"IR\")","v":"IR"},null,null,null,null,null,"lbm","0 - 25","København","Land",null,1,{"$f":"VLOOKUP(Q3,PrisFaktorer!$G$11:$H$14,2,FALSE)","v":{"$error":"#N/A"}},"IR"]
["Kildeplads","Boringsudførelse","Tørboring_Ø250mm_0-30m","STD",null,1257,null,null,{"$f":"IFERROR(T4*U4*V4*F4,\"IR\")","v":"IR"},null,null,null,null,null,"lbm","0 - 25","København","By",null,1,{"$f":"VLOOKUP(Q4,PrisFaktorer!$G$11:$H$14,2,FALSE)","v":{"$error":"#N/A"}},1.2]
["Kildeplads","Boringsudførelse","Tørboring_Ø250mm_0-30m","STD",null,1257,null,null,"IR",null,null,null,null,null,"lbm","0 - 25","København","Centrum",null,1,{"$f":"VLOOKUP(Q5,PrisFaktorer!$G$11:$H$14,2,FALSE)","v":{"$error":"#N/A"}},1.5]
["Kildeplads","Boringsudførelse","Tørboring_Ø250mm_0-30m","STD",null,1257,null,null,"IR",null,null,null,null,null,"lbm","0 - 25","Sjælland","Land",null,1,{"$f":"VLOOKUP(Q6,PrisFaktorer!$G$11:$H$14,2,FALSE)","v":{"$error":"#N/A"}},1]
["Kildeplads","Boringsudførelse","Tørboring_Ø250mm_0-30m","STD",null,1257,null,null,"IR",null,null,null,null,null,"lbm","0 - 25","Sjælland","By",null,1,{"$f":"VLOOKUP(Q7,PrisFaktorer!$G$11:$H$14,2,FALSE)","v":{"$error":"#N/A"}},1.2]
["Kildeplads","Boringsudførelse","Tørboring_Ø250mm_0-30m","STD",null,1257,null,null,"IR",null,null,null,null,null,"lbm","0 - 25","Sjælland","Centrum",null,1,{"$f":"VLOOKUP(Q8,PrisFaktorer!$G$11:$H$14,2,FALSE)","v":{"$error":"#N/A"}},1.5]
["Kildeplads","Boringsudførelse","Tørboring_Ø250mm_0-30m","STD",null,1257,null,null,"IR",null,null,null,null,null,"lbm","0 - 25","Øerne","Land",null,1,{"$f":"VLOOKUP(Q9,PrisFaktorer!$G$11:$H$14,2,FALSE)","v":{"$error":"#N/A"}},1]
["Kildeplads","Boringsudførelse","Tørboring_Ø250mm_0-30m","STD",null,1257,null,null,"IR",null,null,null,null,null,"lbm","0 - 25","Øerne","By",null,1,{"$f":"VLOOKUP(Q10,PrisFaktorer!$G$11:$H$14,2,FALSE)","v":{"$error":"#N/A"}},1.2]
["Kildeplads","Boringsudførelse","Tørboring_Ø250mm_0-30m","STD",null,1257,null,null,"IR",null,null,null,null,null,"lbm","0 - 25","Øerne","Centrum",null,1,{"$f":"VLOOKUP(Q11,PrisFaktorer!$G$11:$H$14,2,FALSE)","v":{"$error":"#N/A"}},1.5]
["Kildeplads","Boringsudførelse","Tørboring_Ø250mm_0-30m","STD",null,1257,null,null,"IR",null,null,null,null,null,"lbm","0 - 25","Jylland","Land",null,1,{"$f":"VLOOKUP(Q12,PrisFaktorer!$G$11:$H$14,2,FALSE)","v":{"$error":"#N/A"}},1]
["Kildeplads","Boringsudførelse","Tørboring_Ø250mm_0-30m","STD",null,1257,null,null,"IR",null,null,null,null,null,"lbm","0 - 25","Jylland","By",null,1,{"$f":"VLOOKUP(Q13,PrisFaktorer!$G$11:$H$14,2,FALSE)","v":{"$error":"#N/A"}},1.2]
["Kildeplads","Boringsudførelse","Tørboring_Ø250mm_0-30m","STD",null,1257,null,null,"IR",null,null,null,null,null,"lbm","0 - 25","Jylland","Centrum",null,1,{"$f":"VLOOKUP(Q14,PrisFaktorer!$G$11:$H$14,2,FALSE)","v":{"$error":"#N/A"}},1.5]
["Kildeplads","Boringsudførelse","Tørboring_Ø250mm_0-30m","STD",null,1257,null,null,"IR",null,null,null,null,null,"lbm","25 - 50","København","Land",null,"IR",{"$f":"VLOOKUP(Q15,PrisFaktorer!$G$11:$H$14,2,FALSE)","v":{"$error":"#N/A"}},"IR"]
["Kildeplads","Boringsudførelse","Tørboring_Ø250mm_0-30m","STD",null,1257,null,null,"IR",null,null,null,null,null,"lbm","25 - 50","København","By",null,"IR",{"$f":"VLOOKUP(Q16,PrisFaktorer!$G$11:$H$14,2,FALSE)","v":{"$error":"#N/A"}},1.2]
["Kildeplads","Boringsudførelse","Tørboring_Ø250mm_0-30m","STD",null,1257,null,null,"IR",null,null,null,null,null,"lbm","25 - 50","København","Centrum",null,"IR",{"$f":"VLOOKUP(Q17,PrisFaktorer!$G$11:$H$14,2,FALSE)","v":{"$error":"#N/A"}},1.5]
["Kildeplads","Boringsudførelse","Tørboring_Ø250mm_0-30m","STD",null,1257,null,null,"IR",null,null,null,null,null,"lbm","25 - 50","Sjælland","Land",null,"IR",{"$f":"VLOOKUP(Q18,PrisFaktorer!$G$11:$H$14,2,FALSE)","v":{"$error":"#N/A"}},1]
["Kildeplads","Boringsudførelse","Tørboring_Ø250mm_0-30m","STD",null,1257,null,null,"IR",null,null,null,null,null,"lbm","25 - 50","Sjælland","By",null,"IR",{"$f":"VLOOKUP(Q19,PrisFaktorer!$G$11:$H$14,2,FALSE)","v":{"$error":"#N/A"}},1.2]
["Kildeplads","Boringsudførelse","Tørboring_Ø250mm_0-30m","STD",null,1257,null,null,"IR",null,null,null,null,null,"lbm","25 - 50","Sjælland","Centrum",null,"IR",{"$f":"VLOOKUP(Q20,PrisFaktorer!$G$11:$H$14,2,FALSE)","v":{"$error":"#N/A"}},1.5]
{"$rows_left_out":54}